{"text_format":"1","workbook":"xlsx","n_sheets":14,"sheets":["Forside","Vejledning","Info","Resultatoversigt","Klimaskærm","TRY","Vinduer","Ventilatorskift + Remtræk","Luftmængde + Veksler","Ventilation remtræk","Belysning","Solceller","Køl","Tabel for nødvendig energiforb."],"not_rendered":{"charts":0,"images":14,"macros":1,"external_links":1,"defined_names":35,"comments":2,"pivot_tables":0},"unopened":[],"bounds":{"document_bytes":16777216,"sheet_cells":100000,"rows_first":2000,"rows_last":500,"rows_between":2000,"halvings":0,"cell_chars":16384,"cell_head_chars":4096},"cells_cut":0,"cells_raw":0,"read":"whole","date_system":"1900"}

{"sheet":"Forside","index":0,"n_rows":0,"n_cols":0,"rows_kept":0,"cut":false,"hidden":false,"merged":[]}

{"sheet":"Vejledning","index":1,"n_rows":3,"n_cols":2,"rows_kept":3,"cut":false,"hidden":false,"merged":[]}
[]
[]
[null,"Dobbeltklik på billedet heruder for at åbne vejledningen:"]

{"sheet":"Info","index":2,"n_rows":19,"n_cols":2,"rows_kept":19,"cut":false,"hidden":false,"merged":[[1,0,1,5],[14,0,14,6]]}
[]
["Bygnings- og kontaktoplysninger"]
[]
["Adresse:"]
["Post nr. :"]
["By:"]
["Kontakt person:"]
["Tlf. nr.:"]
[]
["Opførelsesår:"]
["Areal (etageareal):",2000]
["Opvarmningsform:","Fjernvarme"]
[]
[]
["Priser på energikilde"]
[]
["Energikilde","Pris pr. kWh"]
["El",1.6]
[{"$f":"IF(B12=\"Vælg\",\"Vælg opvarmningsform\",B12)","v":"Fjernvarme"},0.45]

{"sheet":"Resultatoversigt","index":3,"n_rows":14,"n_cols":25,"rows_kept":14,"cut":false,"hidden":false,"merged":[[0,24,0,25],[0,18,0,19],[0,1,0,2],[0,4,0,5],[0,7,0,8],[0,10,0,11],[0,14,0,15]]}
[null,"Klimaskærm",null,null,"Vinduer",null,null,"Ventilatorskift + Remtræk",null,null,"Luftmængde + Veksler",null,null,null,"Belysning",null,null,null,"Solceller",null,null,null,null,null,"Køling"]
[]
[null,null,null,null,null,null,null,null,null,null,null,null,null,null,null,null,null,null,"Årlig energiforbrug [kWh]",225000]
[null,null,null,null,null,null,null,null,null,null,null,null,null,null,null,null,null,null,"Retning","Syd Vest"]
[null,null,null,null,null,null,null,null,null,null,null,null,null,null,null,null,null,null,"- retning i forhold til syd (0°)",45]
[null,null,null,null,null,null,null,null,null,null,null,null,null,null,null,null,null,null,"Hældning",30]
[null,null,null,null,null,null,null,null,null,null,null,null,null,null,null,null,null,null,"Dækningsgrad af solceller [%]",0.3]
[null,null,null,null,null,null,null,null,null,null,null,null,null,null,null,null,null,null,"Areal af solcelleanlæg ",299.87647488246643]
[null,null,null,null,null,null,null,null,null,null,null,null,null,null,null,null,null,null,"Energikilde","El"]
[null,null,null,null,null,null,null,null,null,null,null,null,null,null,null,null,null,null,"Pris pr. kWh",1.6]
[null,null,null,null,null,null,null,null,null,null,null,null,null,null,null,null,null,null,"Økonomisk besparelse",108000]
[null,null,null,null,null,null,null,null,null,null,null,null,null,null,null,null,null,null,"Investering (anslået)",899629.42464739922]
[null,null,null,null,null,null,null,null,null,null,null,null,null,null,null,null,null,null,"Investering"]
[null,null,null,null,null,null,null,null,null,null,null,null,null,null,null,null,null,null,"Tilbagebetalingstid",8.3299020800685106]

{"sheet":"Klimaskærm","index":4,"n_rows":125,"n_cols":29,"rows_kept":125,"cut":false,"hidden":false,"merged":[[35,6,35,13],[11,6,11,13],[35,16,35,24],[11,16,11,24]]}
["Årgang","1960-1980",null,null,null,null,null,null,null,null,null,null,null,"Opslagsliste efterisolering"]
["Byggeri",{"$f":"IFERROR(VLOOKUP(B1,A37:B112,2,FALSE),\"\")","v":"Industrialiseret byggeri"},null,null,null,null,null,null,null,null,null,null,null,1,{"$f":"IFERROR(INDEX($F$15:$N$15,MATCH($N2,$F$11:$N$11,0)),\"\")","v":""}]
["Type","Loft",null,null,null,null,null,null,null,null,null,null,null,2,""]
["Konstruktion","8\" bjælkelag med 50 mm indskudsler på indskudsbrædder ",null,null,null,null,null,null,null,null,null,null,null,3,""]
["Areal",3168,null,null,null,null,null,null,null,null,null,null,null,4,""]
["Efterisolering","150 mm",null,null,null,null,null,null,null,null,null,null,null,5,""]
["Energibesparelse",{"$f":"IFERROR((HLOOKUP(B6,$F$15:$N$27,MATCH(B4,E16:E27,0)+1,FALSE))*B5,\"\")","v":""},null,null,null,null,null,null,null,null,null,null,null,6,""]
["Energikilde",{"$f":"Info!$B$12","v":"Fjernvarme"},null,null,null,null,null,null,null,null,null,null,null,7,""]
["Pris pr. kWh",{"$f":"IFERROR(VLOOKUP(B8,Info!$A$18:$B$22,2,FALSE),\"\")","v":0.45},null,null,null,null,null,null,null,null,null,null,null,8,""]
["Økonomisk besparelse",{"$f":"IFERROR(B7*B9,\"\")","v":""},null,null,null,null,null,null,null,null,null,null,null,9,""]
["Investering (anslået)",{"$f":"IFERROR(IF(B12>0,\"\",((HLOOKUP(B6,$Q$15:$Y$27,MATCH(B4,E16:E27,0)+1,FALSE))*B5)),\"\")","v":""},null,null,null,{"$f":"IF(F13=\"\",\"\",MAX(E$11:$E11)+1)","v":""},{"$f":"IF(G13=\"\",\"\",MAX($E$11:F11)+1)","v":""},{"$f":"IF(H13=\"\",\"\",MAX($E$11:G11)+1)","v":""},{"$f":"IF(I13=\"\",\"\",MAX($E$11:H11)+1)","v":""},{"$f":"IF(J13=\"\",\"\",MAX($E$11:I11)+1)","v":""},{"$f":"IF(K13=\"\",\"\",MAX($E$11:J11)+1)","v":""},{"$f":"IF(L13=\"\",\"\",MAX($E$11:K11)+1)","v":""},{"$f":"IF(M13=\"\",\"\",MAX($E$11:L11)+1)","v":""},{"$f":"IF(N13=\"\",\"\",MAX($E$11:M11)+1)","v":""}]
["Investering",null,null,null,null,null,"Efterisolering",null,null,null,null,null,null,null,null,null,"Investering [kr./m²]"]
["Tilbagebetalingstid",{"$f":"IFERROR(IF(B12>0,B12/B10,B11/B10),\"\")","v":""},null,null,null,{"$f":"IF(SUMIFS(F16:F25,Konstruktion,$B$4)>0,F15,\"\")","v":""},"","","","","","","","",null,null,{"$f":"IF(SUMIFS(Q16:Q25,Konstruktion,$B$4)>0,Q15,\"\")","v":""},"","","","","","","",""]
["Årgang","Byggeri","Type",null,"Konstruktion",{"$f":"IFERROR(IF(OR(F16:F25)>0,F15,\"\"),\"\")","v":""},{"$f":"IFERROR(IF(OR(G16:G25)>0,G15,\"\"),\"\")","v":""},"","","","","","","",null,null,{"$f":"IFERROR(IF(OR(Q16:Q25)>0,Q15,\"\"),\"\")","v":""},{"$f":"IFERROR(IF(OR(R16:R25)>0,R15,\"\"),\"\")","v":""},"","","","","","",""]
[null,null,null,null,null,"70 mm","75 mm","100 mm ","125 mm","130 mm","150 mm","200 mm","225 mm","300 mm",null,null,"70 mm","75 mm","100 mm ","125 mm","130 mm","150 mm","200 mm","225 mm","300 mm"]
[{"$f":"IF(E16=\"\",\"\",(VLOOKUP($B$1,$A$38:$N$113,1,FALSE)))","v":""},{"$f":"IF(E16=\"\",\"\",(VLOOKUP($B$2,$B$38:$N$113,1,FALSE)))","v":""},{"$f":"IF(E16=\"\",\"\",((VLOOKUP($B$3,$C$38:$N$113,1,FALSE))))","v":""},1,{"$f":"IFERROR(VLOOKUP(D16,$D$38:$E$113,2,FALSE),\"\")","v":""},{"$f":"IFERROR(IF((VLOOKUP($D16,$D$38:$N$113,MATCH(F$15,Efterisolering,0)+2,FALSE))=0,\"\",(VLOOKUP($D16,$D$38:$N$113,MATCH(F$15,Efterisolering,0)+2,FALSE))),\"\")","v":""},"","","","","","","","",null,null,{"$f":"IFERROR(IF((VLOOKUP($D16,$D$38:$Y$113,MATCH(Q$15,Efterisolering,0)+13,FALSE))=0,\"\",(VLOOKUP($D16,$D$38:$Y$113,MATCH(Q$15,Efterisolering,0)+13,FALSE))),\"\")","v":""},"","","","","","","",""]
["","","",2,"","","","","","","","","","",null,null,"","","","","","","","",""]
["","","",3,"","","","","","","","","","",null,null,"","","","","","","","",""]
["","","",4,"","","","","","","","","","",null,null,"","","","","","","","",""]
["","","",5,"","","","","","","","","","",null,null,"","","","","","","","",""]
{"$rows_left_out":106}
{"sheet":"TRY","index":5,"n_rows":39,"n_cols":32,"rows_kept":39,"cut":false,"hidden":true,"merged":[[11,15,11,16],[11,24,11,25]]}
["TRY referanceår "]
["TRY er en forkortelse af Test Reference Year. I Danmark benyttes TRY som oftest som betegnelse for Dansk Referenceår TRY (Andersen m.fl., 1982)."]
[]
[]
[]
[]
[]
[]
[]
[]
[]
[null,null,null,null,null,null,null,null,null,null,null,null,null,null,null,"Døgnet",null,"Middel","Timer",null,null,null,null,null,"kl.8-15",null,"Middel","Timer"]
[null,null,null,null,null,null,null,null,null,null,null,null,null,null,null,30,27,{"$f":"AVERAGE(P13:Q13)","v":28.5},5,null,{"$f":"R13*S13","v":142.5},null,null,null,30,27,{"$f":"AVERAGE(Y13:Z13)","v":28.5},4,null,{"$f":"AA13*AB13","v":114}]
[null,null,null,null,null,null,null,null,null,null,null,null,null,null,null,27,24,{"$f":"AVERAGE(P14:Q14)","v":25.5},67,null,{"$f":"R14*S14","v":1708.5},null,null,null,27,24,{"$f":"AVERAGE(Y14:Z14)","v":25.5},45,null,{"$f":"AA14*AB14","v":1147.5}]
[null,null,null,null,null,null,null,null,null,null,null,null,null,null,null,24,21,22.5,149,null,3352.5,null,null,null,24,21,22.5,98,null,2205]
[null,null,null,null,null,null,null,null,null,null,null,null,null,null,null,21,18,19.5,512,null,9984,null,null,null,21,18,19.5,296,null,5772]
[null,null,null,null,null,null,null,null,null,null,null,null,null,null,null,18,15,16.5,1019,null,16813.5,null,null,null,18,15,16.5,441,null,7276.5]
[null,null,null,null,null,null,null,null,null,null,null,null,null,null,null,15,12,13.5,1296,null,17496,null,null,null,15,12,13.5,339,null,4576.5]
[null,null,null,null,null,null,null,null,null,null,null,null,null,null,null,12,9,10.5,960,null,10080,null,null,null,12,9,10.5,250,null,2625]
[null,null,null,null,null,null,null,null,null,null,null,null,null,null,null,9,6,7.5,994,null,7455,null,null,null,9,6,7.5,351,null,2632.5]
{"$rows_left_out":20}
{"sheet":"Vinduer","index":6,"n_rows":37,"n_cols":12,"rows_kept":37,"cut":false,"hidden":false,"merged":[[19,1,19,2],[19,3,19,4],[31,1,31,4]]}
[]
["Vinduer "]
["Vinduesareal. "]
["Eksisterende vindues type","Vælg",null,null,null,null,null,null,"Udskiftning af eksisterende rude med ny  energiglas.",1800,"kr./m²"]
["Nyt vinduestype ","Vælg",null,null,null,null,null,null,"Udskiftning af eksisterende rude med ny 2 lags energirude og varm kant.",2000,"kr./m²"]
["Årlig energibesparelse ",{"$f":"IFERROR(VLOOKUP(B4,A22:E27,MATCH(B5,B21:E21,0)+1,FALSE)*B3,\"\")","v":""},null,null,null,null,null,null,"Udskiftning af eksisterende vindue med ny 2 lags energirude og varm kant. (hele vinduet)",4000,"kr./m²"]
["Energikilde",{"$f":"Info!$B$12","v":"Fjernvarme"},null,null,null,null,null,null,"Udskiftning af eksisterende rude med ny 3 lags energirude og varm kant. (hele vinduet)",4000,"kr./m²"]
["Pris pr. kWh",{"$f":"IFERROR(VLOOKUP(B7,Info!A18:B22,2,FALSE),\"\")","v":0.45}]
["Økonomisk besparelse",{"$f":"IFERROR(B6*B8,\"\")","v":""}]
["Investering (anslået)",{"$f":"IFERROR(IF(B11>0,\"\",(IF(B6>0,HLOOKUP(B5,B21:E29,9,FALSE)*B3,\"\"))),\"\")","v":""}]
["Investering"]
["Tilbagebetalingstid",{"$f":"IFERROR(IF(B11>0,B11/B9,B10/B9),\"\")","v":""}]
[]
[null,null," "]
[]
[]
[]
[]
[]
[null,"Indvendig forbedring",null,"Udskiftning"]
{"$rows_left_out":18}
{"sheet":"Ventilatorskift + Remtræk","index":7,"n_rows":125,"n_cols":33,"rows_kept":125,"cut":false,"hidden":false,"merged":[[19,9,19,14],[101,4,101,13],[50,4,50,13],[50,16,50,25],[67,4,67,13],[67,16,67,25],[84,4,84,13],[84,16,84,25]]}
[]
[]
["Motorstørrelse",5]
["Før: I drift fra kl.:","05:00:00"]
["Før: I drift til kl.:","10:00:00"]
["Før: Timer pr. dag",{"$f":"IFERROR((B5-B4)*24,\"\")","v":5.000000000000016}]
["Før: Dage pr. år",220]
["Før: Driftstimer",{"$f":"IFERROR(B6*B7,\"\")","v":1100.0000000000034}]
["Efter: I drift fra kl.:","05:00:00"]
["Efter: I drift til kl.:","10:00:00"]
["Efter: Timer pr. dag",{"$f":"IFERROR((B10-B9)*24,\"\")","v":5.000000000000016}]
["Efter: Dage pr. år",220]
["Efter: Driftstimer",{"$f":"IFERROR(IF(B12=\"\",\"\",B11*B12),\"\")","v":1100.0000000000034}]
["Remtræk gl.","Remtræk med én almindelig kilerem"]
["Typisk virkningsgrad",0.96]
["Remtræk ny. ","Direkte trukket "]
["Typisk virkningsgrad",1]
[{"$f":"D51","v":"Trykstigning [Pa]"},800]
[{"$f":"E51","v":"Volumenstrøm [m3/s]"},8,null,null,null,null,null,null,1,2,3,4,5,6,7]
["Volumenstrøm [m3/h]",{"$f":"IFERROR(B19*3600,\"\")","v":28800},null,null,null,null,null,null,"Vælg","Typiske virkningsgrader\n[%]"]
{"$rows_left_out":106}
{"sheet":"Luftmængde + Veksler","index":8,"n_rows":124,"n_cols":5,"rows_kept":124,"cut":false,"hidden":false,"merged":[]}
[]
[]
["Hovedluftmængde [m³/h]"]
["I drift fra kl.:","Vælg"]
["I drift til kl.:","Vælg"]
["Timer pr. dag",{"$f":"IFERROR((B5-B4)*24,\"\")","v":""}]
["Dage pr. år"]
["Temperatur indblæsning","Vælg"]
["Nødvendig energi",{"$f":"IFERROR(('Tabel for nødvendig energiforb.'!K15-'Tabel for nødvendig energiforb.'!K13)*((B7*B6)/(365*B6))*B3,\"\")","v":""}]
["Vekslertype gl.","Vælg"]
["ηveksler",{"$f":"VLOOKUP(B10,$B$99:$C$112,2,FALSE)","v":"-"}]
["Vekslertype ny","Vælg"]
["ηveksler",{"$f":"VLOOKUP(B12,$B$99:$C$112,2,FALSE)","v":"-"}]
["Energibesparelse",{"$f":"IFERROR(B13*B9-B11*B9,\"\")","v":""}]
["Energikilde",{"$f":"Info!$B$12","v":"Fjernvarme"}]
["Pris pr. kWh",{"$f":"IFERROR(VLOOKUP(B15,Info!A18:B22,2,FALSE),\"\")","v":0.45}]
["Økonomisk besparelse",{"$f":"IFERROR(B14*B16,\"\")","v":""}]
["Investering"]
["Tilbagebetalingstid",{"$f":"IFERROR(B18/B17,\"\")","v":""}]
[]
{"$rows_left_out":105}
{"sheet":"Ventilation remtræk","index":9,"n_rows":19,"n_cols":15,"rows_kept":19,"cut":false,"hidden":true,"merged":[[2,9,2,14]]}
[]
[null,null,null,null,null,null,null,null,1,2,3,4,5,6,7]
[null,null,null,null,null,null,null,null,"Vælg","Typiske virkningsgrader\n[%]"]
["Motorstørrelse",10,null,null,null,null,null,null,"Remtræk med én almindelig kilerem",0.93,0.94,0.95,0.96,0.97,0.98]
["I drift fra kl.:","01:00:00",null,null,null,null,null,null,"Remtræk med flere almindelig kilerem",0.9,0.91,0.92,0.93]
["I drift til kl.:","20:00:00",null,null,null,null,null,null,"Remtræk med formfortandet kilerem",0.96,0.97,0.98]
["Timer pr. dag",{"$f":"IFERROR((B6-B5)*24,\"\")","v":18.999999999999993},null,null,null,null,null,null,"Poly-V rem",0.97,0.98,0.99]
["Dage pr. år",200,null,null,null,null,null,null,"Fladremstræk",0.97,0.98,0.99]
["Remtræk gl.","Remtræk med én almindelig kilerem",null,null,null,null,null,null,"Tandremstræk",0.97,0.98,0.99]
["Typisk virkningsgrad",0.93,null,null,null,null,null,null,"Direkte trukket ",1]
["Remtræk ny. ","Direkte trukket "]
["Typisk virkningsgrad",1]
["Energibesparelse",{"$f":"IFERROR(IF(B4*B7*B8*(B12-B10)<0,\"\",B4*B7*B8*(B12-B10)),\"\")","v":2659.9999999999973},null,null,null,null,null,"Gl","Vælg",{"$f":"IFERROR(IF(VLOOKUP($B$9,$I$4:$O$10,J2,FALSE)=0,\"\",VLOOKUP($B$9,$I$4:$O$10,J2,FALSE)),\"\")","v":0.93},{"$f":"IFERROR(IF(VLOOKUP($B$9,$I$4:$O$10,K2,FALSE)=0,\"\",VLOOKUP($B$9,$I$4:$O$10,K2,FALSE)),\"\")","v":0.94},0.95,0.96,0.97,0.98]
["Energikilde","El",null,null,null,null,null,"Ny","Vælg",{"$f":"IFERROR(IF(VLOOKUP($B$11,$I$4:$O$10,J2,FALSE)=0,\"\",VLOOKUP($B$11,$I$4:$O$10,J2,FALSE)),\"\")","v":1},{"$f":"IFERROR(IF(VLOOKUP($B$11,$I$4:$O$10,K2,FALSE)=0,\"\",VLOOKUP($B$11,$I$4:$O$10,K2,FALSE)),\"\")","v":""},"","","",""]
["ηenergikilde",1]
["Pris pr. kWh",{"$f":"IFERROR(VLOOKUP(B14,Info!A14:B22,2,FALSE),\"\")","v":1.6}]
["Økonomisk besparelse",{"$f":"IFERROR(B13*B16,\"\")","v":4255.9999999999955}]
["Investering",5000]
["Tilbagebetalingstid",{"$f":"IFERROR(B18/B17,\"\")","v":1.1748120300751892}]

{"sheet":"Belysning","index":10,"n_rows":28,"n_cols":11,"rows_kept":28,"cut":false,"hidden":false,"merged":[]}
["Belysning",null,null,null,null,"Anvendelse","Lyskilde","Inst. effekt [W/m2] ","Mulig udskiftning","Inst. effekt [W/m2] ","Årlig besparelse [kWh/m2/år]"]
["Område","Kontor","Mødelokale","Rest",null,"Gang u. bev. melder","gl. 2 rørs armatur",9,"LED panel",3.6,12.636000000000001]
["Areal",{"$f":"IFERROR(Info!$B$11*B4,\"\")","v":800},{"$f":"IFERROR(Info!$B$11*C4,\"\")","v":700},{"$f":"IFERROR(Info!$B$11*D4,\"\")","v":500},null,"Gang m. bev. melder","gl. 2 rørs armatur",7,"LED panel",2.8,9.8280000000000012]
["%-vis fordeling af områder",0.4,0.35,{"$f":"1-SUM(B4:C4)","v":0.25},null,"Kontor u. bev. melder","gl. 2 rørs armatur",18,"LED panel",4.95,30.537000000000003]
["I drift fra kl.:","07:00:00","08:00:00","07:00:00",null,"Kontor m. bev. melder","gl. 2 rørs armatur",14,"LED panel",3.8499999999999996,23.751000000000001]
["I drift til kl.:","17:00:00","17:00:00","17:00:00",null,"Reception","Lavvolt halogen",20,"LED panel",5.5,33.93]
["Timer pr. dag",{"$f":"IFERROR((B6-B5)*24,\"\")","v":9.999999999999984},{"$f":"IFERROR((C6-C5)*24,\"\")","v":9.0000000000000018},9.999999999999984,null,"Undervisning u. bev. melder","gl. 2 rørs armatur",18,"LED panel",4.95,30.537000000000003]
["Dage pr. år",220,220,220,null,"Undervisning m. bev. melder","gl. 2 rørs armatur",14,"LED panel",3.8499999999999996,23.751000000000001]
["Benyttelsesfaktor",0.8,0.3,0.5]
["Nuværende belysning (W/m²)",20,15,10]
["Fremtidig belysning - LED (W/m²)",{"$f":"IFERROR(IF(B12>0,\"\",VLOOKUP(B$2,$C$26:$D$28,2,FALSE)),\"\")","v":5},{"$f":"IFERROR(IF(C12>0,\"\",VLOOKUP(C$2,$C$26:$D$28,2,FALSE)),\"\")","v":5},{"$f":"IFERROR(IF(D12>0,\"\",VLOOKUP(D$2,$C$26:$D$28,2,FALSE)),\"\")","v":4}]
["- Anden fremtidig belysningseffekt"]
["Energibesparelse",{"$f":"IFERROR(IF(B3*B7*B8*B9*(B10-(IF(B12>0,B12,B11)))/1000<0,\"\",B3*B7*B8*B9*(B10-(IF(B12>0,B12,B11)))/1000),\"\")","v":21119.999999999971},{"$f":"IFERROR(IF(C3*C7*C8*C9*(C10-(IF(C12>0,C12,C11)))/1000<0,\"\",C3*C7*C8*C9*(C10-(IF(C12>0,C12,C11)))/1000),\"\")","v":4158.0000000000009},3299.9999999999945]
["Energikilde","El","El","El"]
["Pris pr. kWh",{"$f":"IFERROR(VLOOKUP(B14,Info!$A$18:$B$22,2,FALSE),\"\")","v":1.6},{"$f":"IFERROR(VLOOKUP(C14,Info!$A$18:$B$22,2,FALSE),\"\")","v":1.6},{"$f":"IFERROR(VLOOKUP(D14,Info!$A$18:$B$22,2,FALSE),\"\")","v":1.6}]
["Økonomisk besparelse",{"$f":"IFERROR(IF(B13=\"\",\"\",B15*B13),\"\")","v":33791.999999999956},{"$f":"IFERROR(IF(C13=\"\",\"\",C15*C13),\"\")","v":6652.800000000002},{"$f":"IFERROR(IF(D13=\"\",\"\",D15*D13),\"\")","v":5279.9999999999918}]
["Investering (anslået)",{"$f":"IFERROR(IF(B18>0,\"\",250*B3),\"\")","v":200000},{"$f":"IFERROR(IF(C18>0,\"\",250*C3),\"\")","v":175000},125000]
["Investering"]
["Vedligeholdelsesbesparelse",5000,3000,2000]
["Tilbagebetalingstid",{"$f":"IFERROR(IF(B18>0,B18,B17)/(B19+B16),\"\")","v":5.1557022066405507},{"$f":"IFERROR(IF(C18>0,C18,C17)/(C19+C16),\"\")","v":18.129454666003642},{"$f":"IFERROR(IF(D18>0,D18,D17)/(D19+D16),\"\")","v":17.170329670329689}]
{"$rows_left_out":9}
{"sheet":"Solceller","index":11,"n_rows":69,"n_cols":22,"rows_kept":69,"cut":false,"hidden":false,"merged":[[20,6,20,7],[0,5,2,16],[3,5,3,6],[54,5,55,5]]}
[null,null,null,null,null,"Skemaet viser forventet elproduktion fra solceller i forhold til den optimale placering, som er en 35 graders hældning på syd-vendt tag. Tallet 100 svarer derfor til placeringen på taget for størst mulig elproduktion fra solcellerne. Tallene er angivet i procent."]
["Solceller"]
["Årlig energiforbrug [kWh]",225000]
["Retning","Vest",null,null,null,"Hældning på solceller",null,0,5,10,15,20,25,30,35,40,45,60,70,90]
["- retning i forhold til syd (0°)",90,null,null,{"$f":"IF(AND($B$4=F5,$B$5=G5),1,0)","v":1},"VEST",90,86,86,86,85,84,83,81,80,78,77,70,66,44]
["Hældning",30,null,null,{"$f":"IF(AND($B$4=F6,$B$5=G6),1,0)","v":0},"SYD VEST",60,86,88,89,90,91,91,91,90,89,88,83,78,64]
["Dækningsgrad af solceller [%]",0.3,null,null,{"$f":"IF(AND($B$4=F7,$B$5=G7),1,0)","v":0},"SYD VEST",45,86,89,91,92,93,94,94,94,94,93,88,82,68]
["Areal af solcelleanlæg ",{"$f":"IFERROR(B3/(V22*V23*1739*((VLOOKUP(1,$E$5:$T$15,MATCH($B$6,$H$4:$T$4,0)+3,FALSE))/100))*B7,\"\")","v":348.00479801175112},null,null,0,"SYD VEST",30,86,89,92,94,95,97,98,97,97,96,93,86,70]
["Energikilde","El",null,null,0,"SYD",15,86,90,93,95,97,98,99,99,99,99,94,88,72]
["Pris pr. kWh",{"$f":"IFERROR(VLOOKUP(B9,Info!$A$18:$B$22,2,FALSE),\"\")","v":1.6},null,null,0,"SYD",0,86,90,93,95,97,99,100,100,100,99,94,88,72]
["Økonomisk besparelse",{"$f":"IFERROR(B3*B7*B10,\"\")","v":108000},null,null,0,"SYD",15,86,90,93,95,97,98,99,99,99,99,94,87,72]
["Investering (anslået)",{"$f":"IFERROR(IF(B13>0,\"\",B8*V24),\"\")","v":1044014.3940352533},null,null,0,"SYD ØST",30,86,89,92,94,95,95,97,97,97,96,92,86,70]
["Investering",null,null,null,0,"SYD ØST",45,86,89,91,92,93,94,94,94,94,93,88,88,68]
["Tilbagebetalingstid",{"$f":"IFERROR(IF(B13>0,B13/B11,B12/B11),\"\")","v":9.6667999447708635},null,null,0,"SYD ØST",60,86,88,89,90,91,91,91,90,89,88,83,78,64]
[null,null,null,null,0,"ØST",90,86,86,86,85,84,83,81,80,78,77,70,66,44]
[]
[]
[]
[]
[]
{"$rows_left_out":50}
{"sheet":"Køl","index":12,"n_rows":11,"n_cols":2,"rows_kept":11,"cut":false,"hidden":false,"merged":[]}
["Køl"]
["Effektforbrug [kWh/år]"]
["- COP-værdi nuværende anlæg"]
["- COP-værdi fremtidigt anlæg"]
["Energibesparelse",{"$f":"IFERROR((B2/B3)-(B2/B4),\"\")","v":""}]
["Energikilde","El"]
["Pris pr. kWh",{"$f":"IFERROR(VLOOKUP(B6,Info!$A$18:$B$22,2,FALSE),\"\")","v":1.6}]
["Økonomisk besparelse",{"$f":"IFERROR(IF(B5=\"\",\"\",B7*B5),\"\")","v":""}]
["Investering"]
["Vedligeholdelsesbesparelse"]
["Tilbagebetalingstid",{"$f":"IFERROR(B9/(B10+B8),\"\")","v":""}]

{"sheet":"Tabel for nødvendig energiforb.","index":13,"n_rows":26,"n_cols":18,"rows_kept":26,"cut":false,"hidden":true,"merged":[[0,14,0,16],[1,11,1,12],[1,15,1,16],[10,9,10,10],[0,0,1,0],[0,1,0,6],[0,7,1,7],[0,10,0,12]]}
["Driftstid fra 0,00 til","Årligt energiforbrug kWh pr.m3 friskluft pr. time opvarmet til",null,null,null,null,null,"Procent-fordeling",null,null,"Nuværende",null,null,null,"Fremtidig"]
[null,18,19,20,21,22,23,null,null,null,"Vent.","Infiltration",null,null,"Vent.","Infiltration"]
[1,1.5,1.7,1.8,1.9,2.1,2.2000000000000002,4.9000000000000004,null,{"$f":"\"Energiforbrug til opvarming af udeluft til \" & 'Luftmængde + Veksler'!#REF! & \"C\" & \" ved åbning.\"","v":{"$error":"#REF!"}},{"$f":"IFERROR((VLOOKUP(('Luftmængde + Veksler'!#REF!*24),$A$3:$G$26,((MATCH('Luftmængde + Veksler'!#REF!,$B$2:$G$2,0))+1))),0)","v":0},{"$f":"IFERROR((VLOOKUP(('Luftmængde + Veksler'!#REF!*24),$A$3:$G$26,((MATCH('Luftmængde + Veksler'!#REF!,$B$2:$G$2,0))+1))),0)","v":0},{"$f":"IFERROR((VLOOKUP(('Luftmængde + Veksler'!#REF!*24),$A$3:$G$26,((MATCH('Luftmængde + Veksler'!#REF!,$B$2:$G$2,0))+1))),0)","v":0},null,{"$f":"IFERROR((VLOOKUP(('Luftmængde + Veksler'!#REF!*24),$A$3:$G$26,((MATCH('Luftmængde + Veksler'!#REF!,$B$2:$G$2,0))+1))),0)","v":0},{"$f":"IFERROR((VLOOKUP(('Luftmængde + Veksler'!#REF!*24),$A$3:$G$26,((MATCH('Luftmængde + Veksler'!#REF!,$B$2:$G$2,0))+1))),0)","v":0},{"$f":"IFERROR((VLOOKUP(('Luftmængde + Veksler'!#REF!*24),$A$3:$G$26,((MATCH('Luftmængde + Veksler'!#REF!,$B$2:$G$2,0))+1))),0)","v":0},"kWh"]
[2,3.1,3.4,3.7,4,4.3,4.5999999999999996,10]
[3,4.7,5.0999999999999996,5.5,6,6.4,6.9,15.1,null,{"$f":"\"Energiforbrug til opvarming af udeluft til \" & 'Luftmængde + Veksler'!#REF! & \"C\" & \" ved lukning.\"","v":{"$error":"#REF!"}},{"$f":"IFERROR(VLOOKUP(('Luftmængde + Veksler'!#REF!*24),$A$3:$G$26,((MATCH('Luftmængde + Veksler'!#REF!,$B$2:$G$2,0))+1)),0)","v":0},0,{"$f":"IFERROR(VLOOKUP(('Luftmængde + Veksler'!#REF!*24),$A$3:$G$26,((MATCH('Luftmængde + Veksler'!#REF!,$B$2:$G$2,0))+1)),0)","v":0},null,{"$f":"IFERROR(VLOOKUP(('Luftmængde + Veksler'!#REF!*24),$A$3:$G$26,((MATCH('Luftmængde + Veksler'!#REF!,$B$2:$G$2,0))+1)),0)","v":0},{"$f":"IFERROR(VLOOKUP(('Luftmængde + Veksler'!#REF!*24),$A$3:$G$26,((MATCH('Luftmængde + Veksler'!#REF!,$B$2:$G$2,0))+1)),0)","v":0},{"$f":"IFERROR(VLOOKUP(('Luftmængde + Veksler'!#REF!*24),$A$3:$G$26,((MATCH('Luftmængde + Veksler'!#REF!,$B$2:$G$2,0))+1)),0)","v":0},"kWh"]
[4,6.3,6.9,7.5,8.1,8.6999999999999993,9.3000000000000007,20.399999999999999]
[5,8,8.6999999999999993,9.4,10.1,10.9,11.6,25.6]
[6,9.6,10.5,11.3,12.2,13.1,14,30.85]
[7,11.2,12.2,13.2,14.3,15.3,16.399999999999999,36.049999999999997]
[8,12.6,13.8,14.9,16.100000000000001,17.3,18.5,40.6]
[9,14.1,15.4,16.7,18,19.399999999999999,20.7,45.5,null,"Dybe energirenoveringer"]
[10,15.4,16.8,18.2,19.7,21.1,22.6,49.65,null,null,"Vent."]
[11,16.600000000000001,18.100000000000001,19.600000000000001,21.1,22.7,24.3,53.35,null,{"$f":"\"Energiforbrug til opvarming af udeluft til \" & 'Luftmængde + Veksler'!B8 & \" °C\" & \" ved åbning.\"","v":"Energiforbrug til opvarming af udeluft til Vælg °C ved åbning."},{"$f":"IFERROR((VLOOKUP(('Luftmængde + Veksler'!B4*24),$A$3:$G$26,((MATCH('Luftmængde + Veksler'!B8,$B$2:$G$2,0))+1))),0)","v":0}]
[12,17.5,19.100000000000001,20.7,22.3,24,25.6,56.36]
[13,18.399999999999999,20.100000000000001,21.7,23.5,25.2,27,59.25,null,{"$f":"\"Energiforbrug til opvarming af udeluft til \" & 'Luftmængde + Veksler'!B8 & \" °C\" & \" ved lukning.\"","v":"Energiforbrug til opvarming af udeluft til Vælg °C ved lukning."},{"$f":"IFERROR(VLOOKUP(('Luftmængde + Veksler'!B5*24),$A$3:$G$26,((MATCH('Luftmængde + Veksler'!B8,$B$2:$G$2,0))+1)),0)","v":0}]
[14,19.3,21,22.8,24.6,26.4,28.3,62.1]
[15,20.2,22,23.8,25.7,27.7,29.6,65]
[16,21.1,23,24.9,26.9,28.9,30.9,67.849999999999994]
[17,22.1,24.1,26.1,28.1,30.2,32.299999999999997,71.05]
[18,23,25.1,27.2,29.4,31.6,33.700000000000003,74.150000000000006]
{"$rows_left_out":6}